Details

    • Template:
    • Sprint:
      EPAM BatchLoader Sprint 19
    • Story Points:
      1
    • Development Team:
      Folijet

      Description

      MappingTest fails on Windows.

      [INFO] Results:
      [INFO] 
      [ERROR] Errors: 
      [ERROR]   MappingTest.testMarcToInstance:40 ยป Marc error parsing data field for tag: 245...
      [INFO] 
      [ERROR] Tests run: 91, Failures: 0, Errors: 1, Skipped: 0
      

        TestRail: Results

          Attachments

            Issue Links

              Activity

                People

                Assignee:
                ruslan_lavrov Ruslan Lavrov
                Reporter:
                Kateryna Senchenko Kateryna Senchenko
                Votes:
                0 Vote for this issue
                Watchers:
                1 Start watching this issue

                  Dates

                  Created:
                  Updated:
                  Resolved:

                    TestRail: Runs

                      TestRail: Cases