Uploaded image for project: 'mod-source-record-storage'
  1. mod-source-record-storage
  2. MODSOURCE-252

RecordServiceTest unit test errors

    XMLWordPrintable

    Details

    • Type: Bug
    • Status: Closed (View Workflow)
    • Priority: TBD
    • Resolution: Duplicate
    • Affects Version/s: None
    • Fix Version/s: None
    • Labels:
      None
    • Template:
    • Story Points:
      0.5
    • Development Team:
      Core: Platform

      Description

      Even with MODSOURCE-251 in place, I get 4 unit test errors today with commit 61562eb1253e0ce554731c8aa4b8ef3f09ce3fa8

      mvn -B install 2>&1 | tee out

      [ERROR] Errors:
      [ERROR] RecordServiceTest.shouldGetFormattedMarcRecord » BadRequest Invalid UUID null
      [ERROR] RecordServiceTest.shouldGetSourceRecordById » Timeout
      [ERROR] RecordServiceTest.shouldNotGetSourceRecordById:754 » BadRequest Invalid UUID n...
      [ERROR] RecordServiceTest.shouldUpdateSuppressFromDiscoveryForRecord » BadRequest Inva...
      [INFO]
      [ERROR] Tests run: 207, Failures: 0, Errors: 4, Skipped: 6

      adam@nzxt:~$ java -version
      openjdk version "14.0.2" 2020-07-14
      OpenJDK Runtime Environment (build 14.0.2+12-Ubuntu-120.04)
      OpenJDK 64-Bit Server VM (build 14.0.2+12-Ubuntu-120.04, mixed mode, sharing)
      adam@nzxt:~$ uname -a
      Linux nzxt 5.8.0-44-generic #50~20.04.1-Ubuntu SMP Wed Feb 10 21:07:30 UTC 2021 x86_64 x86_64 x86_64 GNU/Linux
      adam@nzxt:~$ cat /etc/lsb-release
      DISTRIB_ID=Ubuntu
      DISTRIB_RELEASE=20.04
      DISTRIB_CODENAME=focal
      DISTRIB_DESCRIPTION="Ubuntu 20.04.2 LTS"

        TestRail: Results

          Attachments

            Issue Links

              Activity

                People

                Assignee:
                adam Adam Dickmeiss
                Reporter:
                adam Adam Dickmeiss
                Votes:
                0 Vote for this issue
                Watchers:
                3 Start watching this issue

                  Dates

                  Created:
                  Updated:
                  Resolved:

                    TestRail: Runs

                      TestRail: Cases